{"text_format":"1","workbook":"xlsx","n_sheets":19,"sheets":["Home Page","Valuation Summary","Carriageways & Footways GRC","Footways DRC","Street Lighting GRC & DRC","Traffic Mangt Eqpt GRC & DRC","Street Furniture GRC & DRC","SF - Own Data","SF - Derbyshire","SF - Hertfordshire","SF - Medway","Land GRC","Certificate","Valuation Variables","Regions","Regional Factors","GRC Rates","Land Values","List"],"not_rendered":{"charts":0,"images":10,"macros":1,"external_links":0,"defined_names":52,"comments":0,"pivot_tables":0},"unopened":[],"bounds":{"document_bytes":16777216,"sheet_cells":100000,"rows_first":2000,"rows_last":500,"rows_between":2000,"halvings":0,"cell_chars":16384,"cell_head_chars":4096},"cells_cut":0,"cells_raw":0,"read":"whole","date_system":"1900"}

{"sheet":"Home Page","index":0,"n_rows":50,"n_cols":9,"rows_kept":50,"cut":false,"hidden":false,"merged":[[29,4,29,15],[31,4,31,15],[23,8,23,9],[24,8,24,9],[1,1,2,16],[17,2,18,15],[29,2,29,3],[4,2,4,16],[19,2,21,15],[23,2,23,3],[24,2,24,3],[23,4,23,5],[24,4,24,5],[23,6,23,7],[24,6,24,7],[32,4,32,15],[33,4,33,15],[48,3,48,5],[30,2,30,3],[44,4,44,16],[45,4,45,16],[37,2,38,12],[31,2,31,3],[32,2,32,3],[33,2,33,3],[30,4,30,15]]}
[]
[null,"Valuation Toolkit"]
[]
[]
[null,null,"Valuation Toolkit for Carriageways, Footways & Cycleways, Street Lighting, Street Furniture and Traffic Management Equipment."]
[]
[null,null,null,"These cells need to be completed with own data."]
[]
{"$rows_left_out":43}
{"sheet":"Valuation Summary","index":1,"n_rows":129,"n_cols":11,"rows_kept":129,"cut":false,"hidden":false,"merged":[[126,1,126,2],[124,3,124,6],[115,2,121,10],[8,2,8,10],[10,2,10,10],[50,4,51,4],[17,2,17,11],[18,2,18,10],[11,2,11,10],[16,2,16,9],[114,2,114,10],[65,2,65,10],[62,2,62,10],[63,2,63,10],[124,1,124,2],[2,2,2,10],[4,2,4,10],[112,2,112,11],[67,2,67,11],[68,2,68,11],[50,3,51,3],[50,2,51,2],[111,3,111,6],[50,7,51,7],[50,6,51,6],[50,5,51,5],[49,3,49,6],[5,3,5,11],[6,2,6,10],[48,2,48,7],[7,2,7,10]]}
[]
[]
[null,null,"Valuation Summary"]
[]
[null,null,"Highways Infrastructure Assets"]
[]
[null,null,"This tab is used to capture the information required by local authorities to value their Highways Network Assets on a  Depreciated Replacement Cost (DRC) basis. This information is required for Whole of Government Accounts (WGA) purposes for 2015/16 and from 2016/17 local authorities will be required to value their Highways Network Assets on a DRC basis in their financial statements. Please be aware that in many cases local authority staff outside of the central finance team, such as asset management and engineering staff, are undertaking this work. "]
[null,null,"Please refer to the Data Collection Pack (DCT) guidance, CIPFA's Code of Practice on Transport Infrastructure Assets and the accompanying Guidance Notes, and the Highways Asset Management Financial Information Group's (HAMFIG) supporting materials on the CIPFA website."]
{"$rows_left_out":122}
{"sheet":"Carriageways & Footways GRC","index":2,"n_rows":54,"n_cols":18,"rows_kept":54,"cut":false,"hidden":false,"merged":[[49,1,49,2],[47,3,47,9],[2,2,2,17],[13,6,16,6],[13,14,16,14],[12,2,12,7],[12,12,12,17],[13,16,16,16],[13,17,16,17],[13,15,16,15],[13,13,16,13],[13,10,16,10],[35,15,36,17],[37,15,38,17],[47,1,47,2],[35,12,36,14],[13,4,16,4],[13,3,16,3],[43,15,44,17],[33,12,33,14],[39,15,40,17],[13,5,16,5],[32,2,32,10],[33,2,44,10],[13,7,16,7],[13,9,16,9],[13,2,16,2],[37,12,38,14],[39,12,40,14],[41,12,42,14],[43,12,44,14],[41,15,42,17],[12,9,12,10],[35,18,36,18],[37,18,38,18],[32,12,32,17],[33,15,33,17],[13,12,16,12]]}
[]
[]
[null,null,"Carriageways, Footways & Cycleways GRC"]
[null,null,"Step 1","Enter your CARRIAGEWAY LENGTH and  WIDTH or AREA"]
[null,null,"Step 2","Enter your FOOTWAY LENGTH and WIDTH, or AREA"]
[null,null,"Step 3","Select your REGION and AUTHORITY - this will apply a regional factor."]
[]
[]
{"$rows_left_out":47}
{"sheet":"Footways DRC","index":3,"n_rows":72,"n_cols":12,"rows_kept":72,"cut":false,"hidden":false,"merged":[[47,2,50,2],[31,2,34,2],[27,2,30,2],[35,2,38,2],[23,2,26,2],[43,2,46,2],[1,14,9,18],[2,2,2,11],[11,3,11,11],[16,5,18,5],[16,11,18,11],[16,10,18,10],[16,9,18,9],[16,3,18,3],[16,2,18,2],[12,3,12,11],[68,1,68,2],[16,6,18,6],[59,2,59,11],[60,2,65,11],[54,2,54,3],[55,2,55,3],[56,2,56,3],[57,2,57,3],[52,2,52,3],[16,7,18,7],[51,2,51,3],[16,4,18,4],[16,8,18,8],[53,2,53,3],[39,2,42,2],[19,2,22,2]]}
[]
[]
[null,null,"Footways and Cycleways (DRC)"]
[null,null,"Step 1","For Bituminous, Other Bituminous and other materials such as Mass Concrete (see Note 2 below) enter the CURRENT AREA per Asset Type"]
[null,null,"Step 2","Then enter the Local Average Treatment Cost per Asset Type"]
[null,null,"Step 3","Then enter an ESTIMATED LIFESPAN"]
[null,null,"Step 4","Then enter a SUM OF ALL TREATMENTS IN LIFECYCLE PLAN per Asset Type"]
[null,null,"Step 5","For Modular Slabs, Block Paving and Other Modular enter the CURRENT AREA per Asset Type"]
{"$rows_left_out":65}
{"sheet":"Street Lighting GRC & DRC","index":4,"n_rows":49,"n_cols":13,"rows_kept":49,"cut":false,"hidden":false,"merged":[[2,2,2,12],[27,2,27,12],[36,2,36,12],[10,3,10,4],[28,2,35,12]]}
[]
[]
[null,null,"Street Lighting"]
[null,null,"Step 1","Insert the number of additional rows required for each section"]
[null,null,"Step 2","Complete the Yellow cells with your inventory data"]
[]
[null,null,"Note 1","The INSERT button will allow you to bulk insert any number of rows per type of Street Lighting"]
[null,null,"Note 2","The DELETE button will allow you to delete selected rows only, providing there is one unique asset type remaining"]
{"$rows_left_out":42}
{"sheet":"Traffic Mangt Eqpt GRC & DRC","index":5,"n_rows":48,"n_cols":13,"rows_kept":48,"cut":false,"hidden":false,"merged":[[2,2,2,12],[34,2,34,12],[1,15,8,19],[40,2,40,12],[10,3,10,4],[35,2,39,12]]}
[]
[]
[null,null,"Traffic Management Equipment"]
[null,null,"Step 1","Insert the number of rows required for each section"]
[null,null,"Step 2","Complete the Yellow cells with your inventory data"]
[]
[null,null,"Note 1","The INSERT button will allow you to bulk insert any number of rows per type of Traffic Mangement Equipment"]
[null,null,"Note 2","The DELETE button will allow you to delete selected rows only, providing there is one unique asset type remaining"]
{"$rows_left_out":41}
{"sheet":"Street Furniture GRC & DRC","index":6,"n_rows":21,"n_cols":12,"rows_kept":21,"cut":false,"hidden":false,"merged":[[2,2,2,16],[17,5,18,15],[14,5,14,15],[3,2,4,16],[7,5,8,15],[12,3,12,15],[10,3,11,15],[5,11,5,13]]}
[]
[]
[null,null,"Street Furniture"]
[null,null,"This sheet will allow you to make the most appropriate selection to input Street Furniture data depending on the status of your current inventory.  Please either add your own inventory data or use the sample data, that best matches your own circumstances, provided by one of the authorities below."]
[]
[null,null,"PLEASE ONLY COMPLETE ONE SHEET FOR STREET FURNITURE",null,null,null,null,null,null,null,"Data Selected:","Own Data"]
[]
[null,null,null,null,null,"Own Inventory Data - to be used for authorities with good data."]
{"$rows_left_out":14}
{"sheet":"SF - Own Data","index":7,"n_rows":69,"n_cols":29,"rows_kept":69,"cut":false,"hidden":false,"merged":[[53,2,62,28],[9,20,9,21],[8,20,8,21],[7,20,7,21],[6,20,6,21],[13,4,13,5],[13,6,13,7],[13,8,13,9],[12,20,12,28],[13,18,13,19],[12,2,13,2],[6,3,6,11],[7,3,7,11],[9,3,9,11],[2,20,2,23],[52,2,52,28],[5,20,5,21],[4,20,4,21],[3,20,3,21],[64,3,64,4],[68,3,68,7],[13,16,13,17],[2,13,2,18],[12,4,12,11],[12,12,12,19],[12,3,13,3],[2,2,2,11],[4,13,4,16],[13,10,13,11],[13,12,13,13],[13,14,13,15],[8,3,8,10],[3,3,3,11],[4,3,4,11],[5,3,5,11]]}
[]
[]
[null,null,"Street Furniture - Own Data",null,null,null,null,null,null,null,null,null,null,"Adding Additional Rows",null,null,null,null,null,null,"Network Length (km)"]
[null,null,"Step 1","Enter the Number of Additional Assets Rows required in 'Adding Additional Rows' box and press INSERT ROWS",null,null,null,null,null,null,null,null,null,null,null,null,null,null,null,null,"Road Type/Classification",null," Urban","Rural"]
[null,null,"Step 2","Enter the Urban/Rural NETWORK LENGTHS per Road Type/Classification if this is not already populated",null,null,null,null,null,null,null,null,null,"Number of Additional Assets rows",null,null,null,null,null,null,"A",null,{"$f":"IF('Carriageways & Footways GRC'!D20>0,'Carriageways & Footways GRC'!D20,\"Please enter a length\")","v":"Please enter a length"},{"$f":"IF('Carriageways & Footways GRC'!D21>0,'Carriageways & Footways GRC'!D21,\"Please enter a length\")","v":"Please enter a length"}]
[null,null,"Step 3","Enter the NUMBER OF ASSETS PER ROAD CLASSIFICATION per Asset Type",null,null,null,null,null,null,null,null,null,null,null,null,null,null,null,null,"B",null,{"$f":"IF('Carriageways & Footways GRC'!D22>0,'Carriageways & Footways GRC'!D22,\"Please enter a length\")","v":"Please enter a length"},{"$f":"IF('Carriageways & Footways GRC'!D23>0,'Carriageways & Footways GRC'!D23,\"Please enter a length\")","v":"Please enter a length"}]
[null,null,"Step 4","Enter Local Average Treatment Cost/Unit, Estimated Age of Assets, and Estimated Lifespan for each asset type.",null,null,null,null,null,null,null,null,null,null,null,null,null,null,null,null,"C",null,{"$f":"IF('Carriageways & Footways GRC'!D24>0,'Carriageways & Footways GRC'!D24,\"Please enter a length\")","v":"Please enter a length"},{"$f":"IF('Carriageways & Footways GRC'!D25>0,'Carriageways & Footways GRC'!D25,\"Please enter a length\")","v":"Please enter a length"}]
[null,null,"Step 5","Add any comments to the comments box provided at the bottom of the sheet",null,null,null,null,null,null,null,null,null,null,null,null,null,null,null,null,"UC",null,{"$f":"IF('Carriageways & Footways GRC'!D26>0,'Carriageways & Footways GRC'!D26,\"Please enter a length\")","v":"Please enter a length"},{"$f":"IF('Carriageways & Footways GRC'!D27>0,'Carriageways & Footways GRC'!D27,\"Please enter a length\")","v":"Please enter a length"}]
{"$rows_left_out":62}
{"sheet":"SF - Derbyshire","index":8,"n_rows":68,"n_cols":29,"rows_kept":68,"cut":false,"hidden":false,"merged":[[5,3,5,11],[2,2,2,11],[2,13,2,18],[4,13,4,16],[3,20,3,21],[2,20,2,23],[4,20,4,21],[3,3,3,11],[9,20,9,21],[8,20,8,21],[7,20,7,21],[6,20,6,21],[5,20,5,21],[64,3,64,4],[67,3,67,9],[52,2,52,28],[53,2,62,28],[11,20,12,28],[11,4,12,11],[11,12,12,19],[13,20,13,28],[13,12,13,13],[13,14,13,15],[13,16,13,17],[13,18,13,19],[6,3,6,11],[8,3,8,10],[9,3,9,11],[13,10,13,11],[13,8,13,9],[13,4,13,5],[13,6,13,7]]}
[]
[]
[null,null,"Street Furniture - Derbyshire",null,null,null,null,null,null,null,null,null,null,"Adding Additional Rows",null,null,null,null,null,null,"Network length (km)"]
[null,null,"Step 1","Enter the Number of Additional Assets Rows required in 'Adding Additional Rows' box and press INSERT ROWS",null,null,null,null,null,null,null,null,null,null,null,null,null,null,null,null,"Road Type/Classification",null," Urban","Rural"]
[null,null,"Step 2","Enter the NUMBER OF ASSETS PER ROAD CLASSIFICATION  per Asset Type",null,null,null,null,null,null,null,null,null,"Number of Additional Assets rows",null,null,null,null,null,null,"A",null,{"$f":"IF('Carriageways & Footways GRC'!D20>0,'Carriageways & Footways GRC'!D20,\"Please enter a length\")","v":"Please enter a length"},{"$f":"IF('Carriageways & Footways GRC'!D21>0,'Carriageways & Footways GRC'!D21,\"Please enter a length\")","v":"Please enter a length"}]
[null,null,"Step 3","Enter Local Average Treatment Cost/Unit, Estimated Age of Assets, and Estimated Lifespan for each asset type.",null,null,null,null,null,null,null,null,null,null,null,null,null,null,null,null,"B",null,{"$f":"IF('Carriageways & Footways GRC'!D22>0,'Carriageways & Footways GRC'!D22,\"Please enter a length\")","v":"Please enter a length"},{"$f":"IF('Carriageways & Footways GRC'!D23>0,'Carriageways & Footways GRC'!D23,\"Please enter a length\")","v":"Please enter a length"}]
[null,null,"Step 4","Add any comments to the comments box provided at the bottom of the sheet",null,null,null,null,null,null,null,null,null,null,null,null,null,null,null,null,"C",null,{"$f":"IF('Carriageways & Footways GRC'!D24>0,'Carriageways & Footways GRC'!D24,\"Please enter a length\")","v":"Please enter a length"},{"$f":"IF('Carriageways & Footways GRC'!D25>0,'Carriageways & Footways GRC'!D25,\"Please enter a length\")","v":"Please enter a length"}]
[null,null,null,null,null,null,null,null,null,null,null,null,null,null,null,null,null,null,null,null,"UC",null,{"$f":"IF('Carriageways & Footways GRC'!D26>0,'Carriageways & Footways GRC'!D26,\"Please enter a length\")","v":"Please enter a length"},{"$f":"IF('Carriageways & Footways GRC'!D27>0,'Carriageways & Footways GRC'!D27,\"Please enter a length\")","v":"Please enter a length"}]
{"$rows_left_out":61}
{"sheet":"SF - Hertfordshire","index":9,"n_rows":63,"n_cols":29,"rows_kept":63,"cut":false,"hidden":false,"merged":[[2,2,2,11],[2,13,2,18],[4,13,4,16],[3,3,3,11],[6,3,6,11],[5,3,5,11],[62,3,62,9],[11,4,12,11],[11,12,12,19],[59,3,59,4],[13,12,13,13],[13,10,13,11],[13,8,13,9],[13,6,13,7],[13,4,13,5],[48,2,57,28],[2,20,2,23],[3,20,3,21],[8,20,8,21],[7,20,7,21],[6,20,6,21],[5,20,5,21],[4,20,4,21],[8,3,8,10],[9,3,9,11],[9,20,9,21],[47,2,47,28],[11,20,12,28],[13,20,13,28],[13,18,13,19],[13,16,13,17],[13,14,13,15]]}
[]
[]
[null,null,"Street Furniture - Hertfordshire",null,null,null,null,null,null,null,null,null,null,"Adding Additional Rows",null,null,null,null,null,null,"Network length (km)"]
[null,null,"Step 1","Enter the Number of Additional Assets Rows required in 'Adding Additional Rows' box and press INSERT ROWS",null,null,null,null,null,null,null,null,null,null,null,null,null,null,null,null,"Road Type/Classification",null," Urban","Rural"]
[null,null,"Step 2","Enter the NUMBER OF ASSETS PER ROAD CLASSIFICATION  per Asset Type",null,null,null,null,null,null,null,null,null,"Number of Additional Assets rows",null,null,null,null,null,null,"A",null,{"$f":"IF('Carriageways & Footways GRC'!D20>0,'Carriageways & Footways GRC'!D20,\"Please enter a length\")","v":"Please enter a length"},{"$f":"IF('Carriageways & Footways GRC'!D21>0,'Carriageways & Footways GRC'!D21,\"Please enter a length\")","v":"Please enter a length"}]
[null,null,"Step 3","Enter Local Average Treatment Cost/Unit, Estimated Age of Assets, and Estimated Lifespan for each asset type.",null,null,null,null,null,null,null,null,null,null,null,null,null,null,null,null,"B",null,{"$f":"IF('Carriageways & Footways GRC'!D22>0,'Carriageways & Footways GRC'!D22,\"Please enter a length\")","v":"Please enter a length"},{"$f":"IF('Carriageways & Footways GRC'!D23>0,'Carriageways & Footways GRC'!D23,\"Please enter a length\")","v":"Please enter a length"}]
[null,null,"Step 4","Add any comments to the comments box provided at the bottom of the sheet",null,null,null,null,null,null,null,null,null,null,null,null,null,null,null,null,"C",null,{"$f":"IF('Carriageways & Footways GRC'!D24>0,'Carriageways & Footways GRC'!D24,\"Please enter a length\")","v":"Please enter a length"},{"$f":"IF('Carriageways & Footways GRC'!D25>0,'Carriageways & Footways GRC'!D25,\"Please enter a length\")","v":"Please enter a length"}]
[null,null,null,null,null,null,null,null,null,null,null,null,null,null,null,null,null,null,null,null,"UC",null,{"$f":"IF('Carriageways & Footways GRC'!D26>0,'Carriageways & Footways GRC'!D26,\"Please enter a length\")","v":"Please enter a length"},{"$f":"IF('Carriageways & Footways GRC'!D27>0,'Carriageways & Footways GRC'!D27,\"Please enter a length\")","v":"Please enter a length"}]
{"$rows_left_out":56}
{"sheet":"SF - Medway","index":10,"n_rows":83,"n_cols":29,"rows_kept":83,"cut":false,"hidden":false,"merged":[[2,20,2,23],[7,20,7,21],[6,20,6,21],[5,20,5,21],[4,20,4,21],[3,20,3,21],[79,3,79,4],[82,3,82,9],[67,2,67,28],[68,2,77,28],[9,20,9,21],[13,4,13,5],[13,18,13,19],[8,3,8,10],[9,3,9,11],[13,16,13,17],[11,20,12,28],[11,4,12,11],[11,12,12,19],[13,12,13,13],[13,10,13,11],[13,6,13,7],[13,8,13,9],[13,14,13,15],[8,20,8,21],[2,2,2,11],[2,13,2,18],[4,13,4,16],[3,3,3,11],[6,3,6,11],[5,3,5,11]]}
[]
[]
[null,null,"Street Furniture - Medway",null,null,null,null,null,null,null,null,null,null,"Adding Additional Rows",null,null,null,null,null,null,"Network length (km)"]
[null,null,"Step 1","Enter the Number of Additional Assets Rows required in 'Adding Additional Rows' box and press INSERT ROWS",null,null,null,null,null,null,null,null,null,null,null,null,null,null,null,null,"Road Type/Classification",null," Urban","Rural"]
[null,null,"Step 2","Enter the NUMBER OF ASSETS PER ROAD CLASSIFICATION  per Asset Type",null,null,null,null,null,null,null,null,null,"Number of Additional Assets rows",null,null,null,null,null,null,"A",null,{"$f":"IF('Carriageways & Footways GRC'!D20>0,'Carriageways & Footways GRC'!D20,\"Please enter a length\")","v":"Please enter a length"},{"$f":"IF('Carriageways & Footways GRC'!D21>0,'Carriageways & Footways GRC'!D21,\"Please enter a length\")","v":"Please enter a length"}]
[null,null,"Step 3","Enter Local Average Treatment Cost/Unit, Estimated Age of Assets, and Estimated Lifespan for each asset type.",null,null,null,null,null,null,null,null,null,null,null,null,null,null,null,null,"B",null,{"$f":"IF('Carriageways & Footways GRC'!D22>0,'Carriageways & Footways GRC'!D22,\"Please enter a length\")","v":"Please enter a length"},{"$f":"IF('Carriageways & Footways GRC'!D23>0,'Carriageways & Footways GRC'!D23,\"Please enter a length\")","v":"Please enter a length"}]
[null,null,"Step 4","Add any comments to the comments box provided at the bottom of the sheet",null,null,null,null,null,null,null,null,null,null,null,null,null,null,null,null,"C",null,{"$f":"IF('Carriageways & Footways GRC'!D24>0,'Carriageways & Footways GRC'!D24,\"Please enter a length\")","v":"Please enter a length"},{"$f":"IF('Carriageways & Footways GRC'!D25>0,'Carriageways & Footways GRC'!D25,\"Please enter a length\")","v":"Please enter a length"}]
[null,null,null,null,null,null,null,null,null,null,null,null,null,null,null,null,null,null,null,null,"UC",null,{"$f":"IF('Carriageways & Footways GRC'!D26>0,'Carriageways & Footways GRC'!D26,\"Please enter a length\")","v":"Please enter a length"},{"$f":"IF('Carriageways & Footways GRC'!D27>0,'Carriageways & Footways GRC'!D27,\"Please enter a length\")","v":"Please enter a length"}]
{"$rows_left_out":76}
{"sheet":"Land GRC","index":11,"n_rows":44,"n_cols":8,"rows_kept":44,"cut":false,"hidden":false,"merged":[[6,13,10,13],[39,1,39,2],[39,3,39,4],[40,1,40,2],[7,3,7,10],[43,1,43,2],[27,3,27,6],[12,3,12,9],[26,7,26,8],[28,3,28,6],[30,2,30,6],[22,4,26,4],[22,6,26,6],[16,3,17,3],[16,4,17,4],[31,2,36,6],[13,3,13,9],[2,2,2,10],[11,3,11,10],[10,3,10,10],[9,3,9,10],[6,3,6,10]]}
[]
[]
[null,null," LAND GRC"]
[]
[null,null,"Step 1","Select a REGION"]
[null,null,"Step 2","Select your AUTHORITY (If you are Scotland or Wales please fill in the appropriate yellow cells)"]
[null,null,"Step 3","Enter a VERGE WIDTH"]
[null,null,"Step 4","If your VERGE AREA is not pre-populated or you wish to enter your own please do so in VERGE AREA"]
{"$rows_left_out":37}
{"sheet":"Certificate","index":12,"n_rows":25,"n_cols":15,"rows_kept":25,"cut":false,"hidden":true,"merged":[[17,8,17,10],[24,11,24,13],[24,8,24,10],[24,5,24,7],[19,11,19,13],[18,11,18,13],[22,8,22,10],[21,8,21,10],[20,8,20,10],[19,8,19,10],[18,8,18,10],[23,11,23,13],[16,8,16,10],[16,11,16,13],[17,3,17,4],[18,3,18,4],[23,8,23,10],[23,5,23,7],[22,11,22,13],[21,11,21,13],[20,11,20,13],[22,5,22,7],[21,5,21,7],[20,5,20,7],[19,5,19,7],[18,5,18,7],[17,5,17,7],[17,11,17,13],[14,14,14,15],[13,14,13,15],[2,1,2,17],[3,1,32,1],[32,2,32,17],[3,17,31,17],[4,4,4,14],[6,4,6,14],[8,6,10,12],[19,3,19,4],[24,3,24,4],[23,3,23,4],[22,3,22,4],[21,3,21,4],[20,3,20,4],[16,5,16,7]]}
[]
[]
[]
[]
[null,null,null,null,"VALUATION TOOLKIT"]
[]
[null,null,null,null,"Certificate of Valuation for "]
[]
{"$rows_left_out":18}
{"sheet":"Valuation Variables","index":13,"n_rows":8,"n_cols":5,"rows_kept":8,"cut":false,"hidden":true,"merged":[]}
[]
[null,"Valuation Variable for the Valuation Toolkit "]
[]
[null,"This Workbook contains Regional Factors, HAMFIG Default GRC Rates and Land Values"]
[null,"The Version Control shows when the rates were last updated in this workbook"]
[]
[null,"Version Control","Regional Factors","GRC Rates","Land Values"]
[null,"Version 1.4","2017-06-21","2018-06-06","2018-06-13"]
{"$rows_left_out":1}
{"sheet":"Regions","index":14,"n_rows":13,"n_cols":1,"rows_kept":13,"cut":false,"hidden":true,"merged":[]}
["Regions"]
["Select _a_Region"]
["East_Midlands"]
["East_of_England"]
["Greater_London"]
["North_East"]
["North_West"]
["Scotland"]
{"$rows_left_out":6}
{"sheet":"Regional Factors","index":15,"n_rows":215,"n_cols":3,"rows_kept":215,"cut":false,"hidden":true,"merged":[]}
["Region","Authority","Regional Factor"]
["Select a Region","Pick your Authority",0]
["East Midlands","Derby",96]
["East Midlands","Derbyshire",102]
["East Midlands","Leicester",99]
["East Midlands","Leicestershire",100]
["East Midlands","Lincolnshire",101]
["East Midlands","Northamptonshire",106]
{"$rows_left_out":208}
{"sheet":"GRC Rates","index":16,"n_rows":12,"n_cols":7,"rows_kept":12,"cut":false,"hidden":true,"merged":[]}
["Road Classification","HAMFIG Default GRC Rate (£/m2)","HAMFIG Default GRC Rate (£/m2) - Linear Items","Footway Hierarchy","HAMFIG Default GRC Rate (£/m2)","Inflation year","Inflation Rate"]
["M (all)",160.91,715.13,"1A Urban",251.69,"Inflation - Q1 2010 to Q2 2017",1.1549295774647887]
["A Urban",136.04,604.6,"1  Urban",82.35]
["A Rural",107.73,457.98,"1 Rural",74.84]
["B Urban",126.86,554.47,"2 Urban",75.650000000000006]
["B Rural",100.16,255.15,"2 Rural",68.7]
["C Urban",104.7,482.58,"3 Urban",67.44]
["C Rural",79.92,217.98,"3 Rural",61.24]
{"$rows_left_out":5}
{"sheet":"Land Values","index":17,"n_rows":155,"n_cols":8,"rows_kept":155,"cut":false,"hidden":true,"merged":[]}
["GSS_Code","LA","Ceremonial County","Region","Total Rural Area","Total Urban Area","Rural_per_m2","Urban_per_m2"]
[null,"Pick your Authority",null,"Select a Region",null,null,0,0]
["E06000015","Derby","Derbyshire","East Midlands",279156.81024000002,6927018.9120000014,2.0981999999999998,119.063]
["E10000007","Derbyshire","Derbyshire","East Midlands",33656307.632639997,16320502.34496,2.0981999999999998,118.9586]
["E06000016","Leicester","Leicestershire","East Midlands",158938.81344,7831196.6515200008,2.0981999999999998,179.56720000000001]
["E10000018","Leicestershire","Leicestershire","East Midlands",25578816.975359999,13620039.2064,2.0981999999999998,155.32859999999999]
["E10000019","Lincolnshire","Lincolnshire","East Midlands",68145547.345919997,10660423.403519999,2.0981999999999998,105.5556]
["E10000021","Northamptonshire","Northamptonshire","East Midlands",25297101.30816,13599117.734400002,2.0981999999999998,174.65199999999999]
{"$rows_left_out":148}
{"sheet":"List","index":18,"n_rows":215,"n_cols":14,"rows_kept":215,"cut":false,"hidden":true,"merged":[]}
["Region Unique","Region","Authority - Carriageway","Select a Region","Region","Pick your Authority","Ceremonial County","Pick a Data Category","StreetLighting","IlluminatedSigns","TrafficSignals","Crossings","InfoSystems","InStations"]
["Select_a_Region","Select an Authority","Select an Authority","Select_a_Region","East Midlands","Derby","Derbyshire","Actual Inventory","Please select from list or type a description","Please select from list or type a description","Please select from list or type a description","Please select from list or type a description","Please select from list or type a description","Please select from list or type a description"]
["South_East","East Midlands","Derby","South_East","East Midlands","Derbyshire","Derbyshire","Sample Inventory","Steel Streetlights","Circular 600mm Aluminium 1 Post","Poles","Puffin Crossing","Real Time Passenger Information (display and remote comms)","UTC"]
["London","East Midlands","Derbyshire","London","East Midlands","Leicester","Leicestershire","Estimated Values","Concrete Streetlights ","Circular 750mm Aluminium 1 Post","RAG head halogen","Pelican Crossing","Real Time Passenger Information (bus fits)","UTMC common database"]
["North_East","East Midlands","Leicester","North_East","East Midlands","Leicestershire","Leicestershire","Combination","Other Types of Streetlights (i.e. Bracketed)","Circular 900mm Aluminium 2 Posts","RAG head LED","Toucan Crossing","Variable Message Signs - 50-100mmm x-height","RTPI central server"]
["South_West","East Midlands","Leicestershire","South_West","East Midlands","Lincolnshire","Lincolnshire",null,"Columns up to 6.0m","Circular 1200mm Aluminium 2 Posts","Loop","Pegasus Crossing","Variable Message Signs - 101-175mmm x-height","RTPI bus depot computer instation"]
["West_Midlands","East Midlands","Lincolnshire","West_Midlands","East Midlands","Northamptonshire","Northamptonshire",null,"Columns up to 8.0m","Circular 1500mm Aluminium 2 Posts","MVD Veh","Zebra Crossing","Variable Message Signs - 176-225mmm x-height","ANPR"]
["Yorkshire_and_the_Humber","East Midlands","Northamptonshire","Yorkshire_and_the_Humber","East Midlands","Nottingham","Nottinghamshire",null,"Columns up to 10.0m","Triangular 600mm Aluminium 1 Post","IRs","School Crossing (flashing amber lights per sign)","Vehicle Activated Signs - (VAS)","VMS"]
{"$rows_left_out":207}